BDBM56131 2-(benzyloxy)-5-[(hydroxyimino)methyl]benzoic acid::2-benzoxy-5-(hydroximinomethyl)benzoic acid::5-(hydroxyiminomethyl)-2-phenylmethoxy-benzoic acid::5-(hydroxyiminomethyl)-2-phenylmethoxybenzoic acid::MLS000088799::SMR000071945::cid_898098
SMILES OC(=O)c1cc(CN=O)ccc1OCc1ccccc1
InChI Key InChIKey=BGQOPYLATFCTFO-UHFFFAOYSA-N
Data  2 IC50
  Tab Delimited (TSV)   2D SDfile   Computed 3D by Vconf -m prep SDfile
Find this compound or compounds like it in BindingDB:
Activity Spreadsheet -- Enzyme Inhibition Constant Data from BindingDB
Found 2 hits for monomerid = 56131
TargetM17 leucyl aminopeptidase(Plasmodium falciparum 3D7)
Srmlsc
Curated by PubChem BioAssay
LigandPNGBDBM56131(2-(benzyloxy)-5-[(hydroxyimino)methyl]benzoic acid...)
Affinity DataIC50:  1.64E+4nM. Assay description: Southern Research Molecular Libraries Screening Center (SRMLSC) Southern Research Institute (Birmingham, Alabama) NIH Molecular Libraries Screening...
In DepthDetails PCBioAssay
TargetKallikrein-5(Homo sapiens (Human))
Pcmd
Curated by PubChem BioAssay
LigandPNGBDBM56131(2-(benzyloxy)-5-[(hydroxyimino)methyl]benzoic acid...)
Affinity DataIC50:  5.00E+4nM. Assay description: Molecular Library Screening Center Network (MLSCN) Penn Center for Molecular Discovery (PCMD) Assay Provider: Scott L. Diamond, University of Pennsy...
In DepthDetails PCBioAssay