BDBM562529 Methyl 2-(3-((2-(3-chlorophenyl)-6,7-dihydro-5H-cyclopenta[b]pyridin-4-yl)amino)phenyl)acetate hydrochloride::US11401286, Example 100
SMILES COC(=O)Cc1cccc(Nc2cc(nc3CCCc23)-c2cccc(Cl)c2)c1
InChI Key InChIKey=UPXILWCIOQNTRZ-UHFFFAOYSA-N
Data  2 IC50
  Tab Delimited (TSV)   2D SDfile   Computed 3D by Vconf -m prep SDfile
Find this compound or compounds like it in BindingDB:
Activity Spreadsheet -- Enzyme Inhibition Constant Data from BindingDB
Found 2 hits for monomerid = 562529
TargetIsoform 7 of cAMP-specific 3',5'-cyclic phosphodiesterase 4D(Homo sapiens (Human))
Tetra Discovery Partners
US Patent
LigandPNGBDBM562529(Methyl 2-(3-((2-(3-chlorophenyl)-6,7-dihydro-5H-cy...)
Affinity DataIC50: >1.00E+3nM. Assay description: Assays are performed in 96-well plates in a total volume of 200 μl/well. Compounds are dissolved in dimethylsulfoxide (DMSO) and added to plates...
Ligand InfoPC cidPC sid
In DepthDetails US Patent
TargetcAMP-specific 3',5'-cyclic phosphodiesterase 4B [S133D](Homo sapiens (Human))
Tetra Discovery Partners
US Patent
LigandPNGBDBM562529(Methyl 2-(3-((2-(3-chlorophenyl)-6,7-dihydro-5H-cy...)
Affinity DataIC50: >1.00E+3nM. Assay description: Assays are performed in 96-well plates in a total volume of 200 μl/well. Compounds are dissolved in dimethylsulfoxide (DMSO) and added to plates...
Ligand InfoPC cidPC sid
In DepthDetails US Patent