BDBM56531 (4-chlorophenyl) 4-[(4-anilino-4-oxobutanoyl)oxymethyl]benzoate::(4-chlorophenyl) 4-[(4-oxidanylidene-4-phenylazanyl-butanoyl)oxymethyl]benzoate::4-[(4-anilino-1,4-dioxobutoxy)methyl]benzoic acid (4-chlorophenyl) ester::4-[(4-anilino-4-keto-butanoyl)oxymethyl]benzoic acid (4-chlorophenyl) ester::4-chlorophenyl 4-{[(4-anilino-4-oxobutanoyl)oxy]methyl}benzoate::MLS000583227::SMR000201061::cid_1243594
SMILES Clc1ccc(OC(=O)c2ccc(COC(=O)CCC(=O)Nc3ccccc3)cc2)cc1
InChI Key InChIKey=NVBWLUCRSSGBOQ-UHFFFAOYSA-N
Data  1 IC50
  Tab Delimited (TSV)   2D SDfile   Computed 3D by Vconf -m prep SDfile
Find this compound or compounds like it in BindingDB:
Activity Spreadsheet -- Enzyme Inhibition Constant Data from BindingDB
Found 1 hit for monomerid = 56531
TargetKallikrein-5(Homo sapiens (Human))
Pcmd
Curated by PubChem BioAssay
LigandPNGBDBM56531((4-chlorophenyl) 4-[(4-anilino-4-oxobutanoyl)oxyme...)
Affinity DataIC50:  5.00E+4nM. Assay description: Molecular Library Screening Center Network (MLSCN) Penn Center for Molecular Discovery (PCMD) Assay Provider: Scott L. Diamond, University of Pennsy...
In DepthDetails PCBioAssay