BDBM5720 US8536227, 9
SMILES CN(Cc1cc(O)c(O)c(O)c1)C(=S)\C=C\c1cc(O)c(O)c(Br)c1
InChI Key InChIKey=ACNQVOSYXGNTSS-NSCUHMNNSA-N
Data  1 IC50
  Tab Delimited (TSV)   2D SDfile   Computed 3D by Vconf -m prep SDfile
Find this compound or compounds like it in BindingDB:
Activity Spreadsheet -- Enzyme Inhibition Constant Data from BindingDB
Found 1 hit for monomerid = 5720
TargetInsulin-like growth factor 1 receptor(Homo sapiens (Human))
Novotyr Therapeutics
US Patent
LigandPNGBDBM5720(US8536227, 9)
Affinity DataIC50:  170nM. Assay description: Inhibition assay using IGF1R activity in a cell free kinase assay.
In DepthDetails US Patent