BDBM572546 Ethyl 4-(3-((1-methyl-1H-imidazol-5-yl)methyl)ureido)benzoate::US11452717, Compound TableB-1.20
SMILES CCOC(=O)c1ccc(NC(=O)NCc2cncn2C)cc1
InChI Key InChIKey=QPLIZEZBHLDTFZ-UHFFFAOYSA-N
Data  1 EC50
  Tab Delimited (TSV)   2D SDfile   Computed 3D by Vconf -m prep SDfile
Find this compound or compounds like it in BindingDB:
Activity Spreadsheet -- Enzyme Inhibition Constant Data from BindingDB
Found 1 hit for monomerid = 572546
TargetNicotinamide phosphoribosyltransferase(Homo sapiens (Human))
Sanford Burnham Prebys Medical Discovery Institute
US Patent
LigandPNGBDBM572546(Ethyl 4-(3-((1-methyl-1H-imidazol-5-yl)methyl)urei...)
Affinity DataEC50: >2.00E+4nM. Assay description: NAMPT reaction was performed in 50 mM HEPES, pH 7.5, containing 5 mM MgCl2, 0.1% Prionex, 0.005% Tween 20, and 1 mM TCEP at room temperature in Grein...
Ligand InfoPC cidPC sid
In DepthDetails US Patent