BDBM572836 Ethyl 4-(3-(pyridin-2-ylmethyl)ureido)benzoate::US11452717, Compound TableB-3.13
SMILES CCOC(=O)c1ccc(NC(=O)NCc2ccccn2)cc1
InChI Key InChIKey=SOVWUBCNAVMQMS-UHFFFAOYSA-N
Data  1 EC50
  Tab Delimited (TSV)   2D SDfile   Computed 3D by Vconf -m prep SDfile
Find this compound or compounds like it in BindingDB:
Activity Spreadsheet -- Enzyme Inhibition Constant Data from BindingDB
Found 1 hit for monomerid = 572836
TargetNicotinamide phosphoribosyltransferase(Homo sapiens (Human))
Sanford Burnham Prebys Medical Discovery Institute
US Patent
LigandPNGBDBM572836(Ethyl 4-(3-(pyridin-2-ylmethyl)ureido)benzoate | U...)
Affinity DataEC50: >2.00E+4nM. Assay description: NAMPT reaction was performed in 50 mM HEPES, pH 7.5, containing 5 mM MgCl2, 0.1% Prionex, 0.005% Tween 20, and 1 mM TCEP at room temperature in Grein...
Ligand InfoPC cidPC sid
In DepthDetails US Patent