BDBM572842 Ethyl 4-(3-(quinolin-4-ylmethyl)ureido)benzoate::US11452717, Example 347
SMILES CCOC(=O)c1ccc(NC(=O)NCc2ccnc3ccccc23)cc1
InChI Key InChIKey=CUBDSRAWGQAORB-UHFFFAOYSA-N
Data  1 EC50
  Tab Delimited (TSV)   2D SDfile   Computed 3D by Vconf -m prep SDfile
Find this compound or compounds like it in BindingDB:
Activity Spreadsheet -- Enzyme Inhibition Constant Data from BindingDB
Found 1 hit for monomerid = 572842
TargetNicotinamide phosphoribosyltransferase(Homo sapiens (Human))
Sanford Burnham Prebys Medical Discovery Institute
US Patent
LigandPNGBDBM572842(Ethyl 4-(3-(quinolin-4-ylmethyl)ureido)benzoate | ...)
Affinity DataEC50: >2.00E+4nM. Assay description: NAMPT reaction was performed in 50 mM HEPES, pH 7.5, containing 5 mM MgCl2, 0.1% Prionex, 0.005% Tween 20, and 1 mM TCEP at room temperature in Grein...
Ligand InfoPC cidPC sid
In DepthDetails US Patent