BDBM575527 US11459339, Example 24::dimethyl 2,2'-((((((2,2'- dimethyl-[1,1'-biphenyl]-3,3'- diyl)bis(azanediyl))bis(carbonyl)) bis(4-methylpyridine-6,3-diyl))bis (methylene))bis(azanediyl))diacetate
SMILES COC(=O)CNCc1cnc(cc1C)C(=O)Nc1cccc(c1C)-c1cccc(NC(=O)c2cc(C)c(CNCC(=O)OC)cn2)c1C
InChI Key InChIKey=XDSGYNFTJKJLTE-UHFFFAOYSA-N
Data  1 IC50
  Tab Delimited (TSV)   2D SDfile   Computed 3D by Vconf -m prep SDfile
Find this compound or compounds like it in BindingDB:
Activity Spreadsheet -- Enzyme Inhibition Constant Data from BindingDB
Found 1 hit for monomerid = 575527
TargetProgrammed cell death 1 ligand/protein 1(Homo sapiens)
Abbisko Therapeutics
US Patent
LigandPNGBDBM575527(US11459339, Example 24 | dimethyl 2,2'-((((((2,2'-...)
Affinity DataIC50:  3.20nM. Assay description: The effect of compounds and positive compounds of the examples of the present invention on the interaction between PD-1 and PD-L1 was determined by t...
Ligand InfoPC cidPC sid
In DepthDetails US Patent