BDBM57821 4-methyl-N'-[1-(5-methyl-2-furyl)ethylidene]benzenesulfonohydrazide::4-methyl-N-[1-(5-methyl-2-furanyl)ethylideneamino]benzenesulfonamide::4-methyl-N-[1-(5-methyl-2-furyl)ethylideneamino]benzenesulfonamide::4-methyl-N-[1-(5-methylfuran-2-yl)ethylideneamino]benzenesulfonamide::MLS000673644::SMR000298171::cid_879696
SMILES CC(=NNS(=O)(=O)c1ccc(C)cc1)c1ccc(C)o1
InChI Key InChIKey=VPIRQNZWLUYGDZ-UHFFFAOYSA-N
Data  1 EC50
  Tab Delimited (TSV)   2D SDfile   Computed 3D by Vconf -m prep SDfile
Find this compound or compounds like it in BindingDB:
Activity Spreadsheet -- Enzyme Inhibition Constant Data from BindingDB
Found 1 hit for monomerid = 57821
TargetStreptokinase A(Streptococcus pyogenes M1 GAS)
Broad Institute
Curated by PubChem BioAssay
LigandPNGBDBM57821(4-methyl-N'-[1-(5-methyl-2-furyl)ethylidene]be...)
Affinity DataEC50:  1.50E+5nM. Assay description: Keywords: Group A streptococcus, GAS, streptokinase, expression, virulence, inhibition, dose response, EC50 Assay Overview: The goal of this assa...
In DepthDetails PCBioAssay