BDBM578441 Methyl 3-(2-((4-(1H-pyrazol-4-yl)phenyl)amino)-1-(methylamino)-2-oxoethyl)benzoate::US11479533, Example 30
SMILES CNC(C(=O)Nc1ccc(cc1)-c1cn[nH]c1)c1cccc(c1)C(=O)OC
InChI Key
Data  1 IC50
  Tab Delimited (TSV)   2D SDfile   Computed 3D by Vconf -m prep SDfile
Find this compound or compounds like it in BindingDB:
Activity Spreadsheet -- Enzyme Inhibition Constant Data from BindingDB
Found 1 hit for monomerid = 578441
TargetRho-associated protein kinase 2 [1-552](Homo sapiens (Human))
Kadmon
US Patent
LigandPNGBDBM578441(Methyl 3-(2-((4-(1H-pyrazol-4-yl)phenyl)amino)-1-(...)
Affinity DataIC50:  18nM. Assay description: Compounds activities were measured by Z'-lyte kinase kit (ThermoFisher Scientific). The percent inhibition rate was calculated by normalizing the...
Ligand InfoPC cidPC sid
In DepthDetails US Patent