BDBM582920 Acid ::US11548883, Compound 73
SMILES CCOC(=O)COc1nn(CC(=O)OC(C)(C)C)cc1-c1cnc(NC2Cc3ccccc3C2)nc1
InChI Key InChIKey=DJFUCQZNVIHHLH-UHFFFAOYSA-N
Data  1 IC50
  Tab Delimited (TSV)   2D SDfile   Computed 3D by Vconf -m prep SDfile
Find this compound or compounds like it in BindingDB:
Activity Spreadsheet -- Enzyme Inhibition Constant Data from BindingDB
Found 1 hit for monomerid = 582920
TargetEctonucleotide pyrophosphatase/phosphodiesterase family member 2(Homo sapiens (Human))
Legochem Biosciences
US Patent
LigandPNGBDBM582920(Acid | US11548883, Compound 73)
Affinity DataIC50:  3.70nM. Assay description: Two-fold dilution of each test compound solution (10 μM, 100% dimethyl sulfoxide) is carried out on 96-well V bottom plate (Costar 3363). After ...
Ligand InfoPC cidPC sid
In DepthDetails US Patent