BDBM58555 5-methyl-2-(2-thenoylthiocarbamoylamino)thiazole-4-carboxylic acid methyl ester::5-methyl-2-[[[[oxo(thiophen-2-yl)methyl]amino]-sulfanylidenemethyl]amino]-4-thiazolecarboxylic acid methyl ester::MLS001120772::SMR000664588::cid_2298933::methyl 5-methyl-2-(thiophen-2-ylcarbonylcarbamothioylamino)-1,3-thiazole-4-carboxylate::methyl 5-methyl-2-(thiophene-2-carbonylcarbamothioylamino)-1,3-thiazole-4-carboxylate
SMILES COC(=O)c1nc(NC(=S)NC(=O)c2cccs2)sc1C
InChI Key InChIKey=MHBBTISSEYQIQR-UHFFFAOYSA-N
Data  2 EC50
  Tab Delimited (TSV)   2D SDfile   Computed 3D by Vconf -m prep SDfile
Find this compound or compounds like it in BindingDB:
Activity Spreadsheet -- Enzyme Inhibition Constant Data from BindingDB
Found 2 hits for monomerid = 58555
TargetTumor necrosis factor receptor superfamily member 10B(Homo sapiens (Human))
Burnham Center For Chemical Genomics
Curated by PubChem BioAssay
LigandPNGBDBM58555(5-methyl-2-(2-thenoylthiocarbamoylamino)thiazole-4...)
Affinity DataEC50: >1.25E+4nM
In DepthDetails PCBioAssay
TargetStreptokinase A(Streptococcus pyogenes M1 GAS)
Broad Institute
Curated by PubChem BioAssay
LigandPNGBDBM58555(5-methyl-2-(2-thenoylthiocarbamoylamino)thiazole-4...)
Affinity DataEC50:  1.50E+5nM. Assay description: Keywords: Group A streptococcus, GAS, streptokinase, expression, virulence, inhibition, dose response, EC50 Assay Overview: The goal of this assa...
In DepthDetails PCBioAssay