BDBM589789 2-(2-(3-carbamoyl-1H-indazol-1-yl)-N-(2-((3-chloro-2-fluorobenzyl)amino)-2-oxoethyl)acetamido)acetate::US11559515, Compound 51b
SMILES NC(=O)c1nn(CC(=O)N(CC([O-])=O)CC(=O)NCc2cccc(Cl)c2F)c2ccccc12
InChI Key InChIKey=QCUDFGPVHIUQHW-UHFFFAOYSA-M
Data  1 IC50
  Tab Delimited (TSV)   2D SDfile   Computed 3D by Vconf -m prep SDfile
Find this compound or compounds like it in BindingDB:
Activity Spreadsheet -- Enzyme Inhibition Constant Data from BindingDB
Found 1 hit for monomerid = 589789
TargetComplement factor D(Homo sapiens (Human))
Biocryst Pharmaceuticals
US Patent
LigandPNGBDBM589789(2-(2-(3-carbamoyl-1H-indazol-1-yl)-N-(2-((3-chloro...)
Affinity DataIC50:  5.50E+3nM. Assay description: An established esterolytic assay for the measurement of Factor D activity and inhibition of Factor D activity was used (Kam, C. M.; McRae, B. J.; Har...
Ligand InfoPC cidPC sid
In DepthDetails US Patent