BDBM589808 US11559538, Example 65::US11559538, Example 66::US11559538, Example 67
SMILES COc1ccc(cc1OC1CCCC1)-c1cccc(n1)C1COB(O)C1
InChI Key InChIKey=QHEKZUAHSBRTKE-UHFFFAOYSA-N
Data  12 IC50
  Tab Delimited (TSV)   2D SDfile   Computed 3D by Vconf -m prep SDfile
Find this compound or compounds like it in BindingDB:
Activity Spreadsheet -- Enzyme Inhibition Constant Data from BindingDB
Found 12 hits for monomerid = 589808
TargetIsoform PDE4B2 of cAMP-specific 3',5'-cyclic phosphodiesterase 4B(Homo sapiens (Human))
Pfizer
US Patent
LigandPNGBDBM589808(US11559538, Example 65 | US11559538, Example 66 | ...)
Affinity DataIC50:  9.53nM. Assay description: Cytokine inhibitory activity is determined by measuring the effect of test agent on the release of the cytokines IL-4, IL-13 and IFNγ from human...
Ligand InfoPC cidPC sid
In DepthDetails US Patent
TargetInterleukin-13(Human)
Pfizer
US Patent
LigandPNGBDBM589808(US11559538, Example 65 | US11559538, Example 66 | ...)
Affinity DataIC50:  814nM
Ligand InfoPC cidPC sid
In DepthDetails US Patent
TargetInterleukin-4(Human)
Pfizer
US Patent
LigandPNGBDBM589808(US11559538, Example 65 | US11559538, Example 66 | ...)
Affinity DataIC50:  186nM
Ligand InfoPC cidPC sid
In DepthDetails US Patent
TargetInterferon gamma receptor 1(Homo sapiens (Human))
Pfizer
US Patent
LigandPNGBDBM589808(US11559538, Example 65 | US11559538, Example 66 | ...)
Affinity DataIC50:  5.34nM
Ligand InfoPC cidPC sid
In DepthDetails US Patent
TargetIsoform PDE4B2 of cAMP-specific 3',5'-cyclic phosphodiesterase 4B(Homo sapiens (Human))
Pfizer
US Patent
LigandPNGBDBM589808(US11559538, Example 65 | US11559538, Example 66 | ...)
Affinity DataIC50:  2.15nM. Assay description: Cytokine inhibitory activity is determined by measuring the effect of test agent on the release of the cytokines IL-4, IL-13 and IFNγ from human...
Ligand InfoPC cidPC sid
In DepthDetails US Patent
TargetInterferon gamma receptor 1(Homo sapiens (Human))
Pfizer
US Patent
LigandPNGBDBM589808(US11559538, Example 65 | US11559538, Example 66 | ...)
Affinity DataIC50:  12.6nM
Ligand InfoPC cidPC sid
In DepthDetails US Patent
TargetInterleukin-4(Human)
Pfizer
US Patent
LigandPNGBDBM589808(US11559538, Example 65 | US11559538, Example 66 | ...)
Affinity DataIC50:  86.5nM
Ligand InfoPC cidPC sid
In DepthDetails US Patent
TargetInterferon gamma receptor 1(Homo sapiens (Human))
Pfizer
US Patent
LigandPNGBDBM589808(US11559538, Example 65 | US11559538, Example 66 | ...)
Affinity DataIC50:  0.710nM
Ligand InfoPC cidPC sid
In DepthDetails US Patent
TargetIsoform PDE4B2 of cAMP-specific 3',5'-cyclic phosphodiesterase 4B(Homo sapiens (Human))
Pfizer
US Patent
LigandPNGBDBM589808(US11559538, Example 65 | US11559538, Example 66 | ...)
Affinity DataIC50:  4.02nM. Assay description: Cytokine inhibitory activity is determined by measuring the effect of test agent on the release of the cytokines IL-4, IL-13 and IFNγ from human...
Ligand InfoPC cidPC sid
In DepthDetails US Patent
TargetInterleukin-13(Human)
Pfizer
US Patent
LigandPNGBDBM589808(US11559538, Example 65 | US11559538, Example 66 | ...)
Affinity DataIC50:  759nM
Ligand InfoPC cidPC sid
In DepthDetails US Patent
TargetInterleukin-4(Human)
Pfizer
US Patent
LigandPNGBDBM589808(US11559538, Example 65 | US11559538, Example 66 | ...)
Affinity DataIC50:  99.9nM
Ligand InfoPC cidPC sid
In DepthDetails US Patent
TargetInterleukin-13(Human)
Pfizer
US Patent
LigandPNGBDBM589808(US11559538, Example 65 | US11559538, Example 66 | ...)
Affinity DataIC50:  327nM
Ligand InfoPC cidPC sid
In DepthDetails US Patent