BDBM593589 US11578066, Compound II-11::tert-butyl 2-(4-(5-(difluoromethyl)-1,3,4- oxadiazol-2-yl)-2-oxopyridin-1(2H)-yl)acetate
SMILES CC(C)(C)OC(=O)Cn1ccc(cc1=O)-c1nnc(o1)C(F)F
InChI Key InChIKey=MWVXMACMKCJEIJ-UHFFFAOYSA-N
Data  1 IC50
  Tab Delimited (TSV)   2D SDfile   Computed 3D by Vconf -m prep SDfile
Find this compound or compounds like it in BindingDB:
Activity Spreadsheet -- Enzyme Inhibition Constant Data from BindingDB
Found 1 hit for monomerid = 593589
TargetHistone deacetylase 6(Homo sapiens (Human))
Tenaya Therapeutics
US Patent
LigandPNGBDBM593589(US11578066, Compound II-11 | tert-butyl 2-(4-(5-(d...)
Affinity DataIC50:  145nM. Assay description: The compounds disclosed herein were tested for potency against HDAC6 and selectivity against HDAC1 in a biochemical assay. A biochemical assay was ad...
Ligand InfoPC cidPC sid
In DepthDetails US Patent