BDBM59498 MLS000729068::N-[(2-methyl-4-quinolinyl)methyl]-2-phenoxyacetamide::N-[(2-methyl-4-quinolyl)methyl]-2-phenoxy-acetamide::N-[(2-methylquinolin-4-yl)methyl]-2-phenoxy-ethanamide::N-[(2-methylquinolin-4-yl)methyl]-2-phenoxyacetamide::SMR000307346::cid_1504524
SMILES Cc1cc(CNC(=O)COc2ccccc2)c2ccccc2n1
InChI Key InChIKey=HCGGGYWJQOEMGV-UHFFFAOYSA-N
Data  1 IC50
  Tab Delimited (TSV)   2D SDfile   Computed 3D by Vconf -m prep SDfile
Find this compound or compounds like it in BindingDB:
Activity Spreadsheet -- Enzyme Inhibition Constant Data from BindingDB
Found 1 hit for monomerid = 59498
TargetE3 ubiquitin-protein ligase XIAP(Homo sapiens (Human))
Sanford-Burnham Center For Chemical Genomics
Curated by PubChem BioAssay
LigandPNGBDBM59498(MLS000729068 | N-[(2-methyl-4-quinolinyl)methyl]-2...)
Affinity DataIC50:  1.00E+5nM. Assay description: Data Source: Sanford-Burnham Center for Chemical Genomics (SBCCG) Source Affiliation: Sanford-Burnham Medical Research Institute (SBMRI, San Diego, C...
In DepthDetails PCBioAssay