BDBM59804 2-[(1-phenyl-1,2,4-triazol-3-yl)oxy]acetic acid ethyl ester::MLS000539840::SMR000125298::cid_1486530::ethyl 2-[(1-phenyl-1,2,4-triazol-3-yl)oxy]acetate::ethyl 2-[(1-phenyl-1,2,4-triazol-3-yl)oxy]ethanoate::ethyl 2-[(1-phenyl-1H-1,2,4-triazol-3-yl)oxy]acetate
SMILES CCOC(=O)COc1ncn(n1)-c1ccccc1
InChI Key InChIKey=WMYNJPNVAKFTFP-UHFFFAOYSA-N
Data  1 IC50
  Tab Delimited (TSV)   2D SDfile   Computed 3D by Vconf -m prep SDfile
Find this compound or compounds like it in BindingDB:
Activity Spreadsheet -- Enzyme Inhibition Constant Data from BindingDB
Found 1 hit for monomerid = 59804
TargetM17 leucyl aminopeptidase(Plasmodium falciparum 3D7)
Srmlsc
Curated by PubChem BioAssay
LigandPNGBDBM59804(2-[(1-phenyl-1,2,4-triazol-3-yl)oxy]acetic acid et...)
Affinity DataIC50:  1.39E+4nM. Assay description: Southern Research Molecular Libraries Screening Center (SRMLSC) Southern Research Institute (Birmingham, Alabama) NIH Molecular Libraries Screening...
In DepthDetails PCBioAssay