BDBM60255 2-[(5-methyl-4-phenyl-1,3-thiazol-2-yl)methyl]-1,3-thiazol-4-ol::2-[(5-methyl-4-phenyl-2-thiazolyl)methyl]-4-thiazolol::2-[(5-methyl-4-phenyl-thiazol-2-yl)methyl]thiazol-4-ol::MLS000736195::SMR000338445::cid_4318310
SMILES Cc1sc(Cc2nc(O)cs2)nc1-c1ccccc1
InChI Key InChIKey=RJEADPAJVSGAAR-UHFFFAOYSA-N
Data  1 IC50
  Tab Delimited (TSV)   2D SDfile   Computed 3D by Vconf -m prep SDfile
Find this compound or compounds like it in BindingDB:
Activity Spreadsheet -- Enzyme Inhibition Constant Data from BindingDB
Found 1 hit for monomerid = 60255
TargetKappa-type opioid receptor(Homo sapiens (Human))
Burnham Center For Chemical Genomics
Curated by PubChem BioAssay
LigandPNGBDBM60255(2-[(5-methyl-4-phenyl-1,3-thiazol-2-yl)methyl]-1,3...)
Affinity DataIC50:  1.56E+4nM. Assay description: Data Source: Sanford-Burnham Center for Chemical Genomics (SBCCG) Source Affiliation: Sanford-Burnham Medical Research Institute (SBMRI, San Diego, C...
In DepthDetails PCBioAssay