BDBM61993 4-chloro-2-[(4-chlorobenzoyl)amino]benzoic acid methyl ester::4-chloro-2-[[(4-chlorophenyl)-oxomethyl]amino]benzoic acid methyl ester::KSC-6-271::KUC105796N::cid_44443669::methyl 4-chloranyl-2-[(4-chlorophenyl)carbonylamino]benzoate::methyl 4-chloro-2-[(4-chlorobenzoyl)amino]benzoate
SMILES COC(=O)c1ccc(Cl)cc1NC(=O)c1ccc(Cl)cc1
InChI Key InChIKey=RPWGOHXBTFNPKI-UHFFFAOYSA-N
Data  2 IC50
  Tab Delimited (TSV)   2D SDfile   Computed 3D by Vconf -m prep SDfile
Find this compound or compounds like it in BindingDB:
Activity Spreadsheet -- Enzyme Inhibition Constant Data from BindingDB
Found 2 hits for monomerid = 61993
TargetPhosphotransferase(Trypanosoma brucei)
University Of Pittsburgh
Curated by PubChem BioAssay
LigandPNGBDBM61993(4-chloro-2-[(4-chlorobenzoyl)amino]benzoic acid me...)
Affinity DataIC50:  2.50E+4nM. Assay description: Excerpt from MH0882340 application (Dr. James Morris, Clemson University) Trypanosoma brucei, the digenic protozoan parasite that causes African slee...
In DepthDetails PCBioAssay
TargetGlucose-6-phosphate 1-dehydrogenase(Leuconostoc mesenteroides)
University Of Pittsburgh
Curated by PubChem BioAssay
LigandPNGBDBM61993(4-chloro-2-[(4-chlorobenzoyl)amino]benzoic acid me...)
Affinity DataIC50: >2.50E+4nM. Assay description: Excerpt from MH082340 application (Dr. James Morris, Clemson University) Trypanosoma brucei, the digenic protozoan parasite that causes African sleep...
In DepthDetails PCBioAssay