BDBM62430 2-(2,4-dichlorophenyl)-2-oxoethyl 3-(isobutyrylamino)benzoate::3-(isobutyrylamino)benzoic acid [2-(2,4-dichlorophenyl)-2-keto-ethyl] ester::3-[(2-methyl-1-oxopropyl)amino]benzoic acid [2-(2,4-dichlorophenyl)-2-oxoethyl] ester::MLS000537104::SMR000164233::[2-(2,4-dichlorophenyl)-2-oxidanylidene-ethyl] 3-(2-methylpropanoylamino)benzoate::[2-(2,4-dichlorophenyl)-2-oxoethyl] 3-(2-methylpropanoylamino)benzoate::cid_1218592
SMILES CC(C)C(=O)Nc1cccc(c1)C(=O)OCC(=O)c1ccc(Cl)cc1Cl
InChI Key InChIKey=LJUKYXGVHFVNGC-UHFFFAOYSA-N
Data  3 IC50
  Tab Delimited (TSV)   2D SDfile   Computed 3D by Vconf -m prep SDfile
Find this compound or compounds like it in BindingDB:
Activity Spreadsheet -- Enzyme Inhibition Constant Data from BindingDB
Found 3 hits for monomerid = 62430
TargetTrans-activator protein BZLF1(Human herpesvirus 4)
The Scripps Research Institute Molecular Screening Center
Curated by PubChem BioAssay
LigandPNGBDBM62430(2-(2,4-dichlorophenyl)-2-oxoethyl 3-(isobutyrylami...)
Affinity DataIC50:  1.11E+5nM. Assay description: Source (MLPCN Center Name): The Scripps Research Institute Molecular Screening Center (SRIMSC) Center Affiliation: The Scripps Research Institute (TS...
In DepthDetails PCBioAssay
TargetApelin receptor(Homo sapiens (Human))
Sanford-Burnham Center For Chemical Genomics
Curated by PubChem BioAssay
LigandPNGBDBM62430(2-(2,4-dichlorophenyl)-2-oxoethyl 3-(isobutyrylami...)
Affinity DataIC50: >4.00E+4nM. Assay description: Data Source: Sanford-Burnham Center for Chemical Genomics (SBCCG) Source Affiliation: Sanford- Sanford-Burnham Medical Research Institute(SBMRI, San...
In DepthDetails PCBioAssay
TargetEpstein-Barr nuclear antigen 1(Human herpesvirus 4)
The Scripps Research Institute Molecular Screening Center
Curated by PubChem BioAssay
LigandPNGBDBM62430(2-(2,4-dichlorophenyl)-2-oxoethyl 3-(isobutyrylami...)
Affinity DataIC50:  1.13E+4nM. Assay description: Source (MLPCN Center Name): The Scripps Research Institute Molecular Screening Center (SRIMSC) Center Affiliation: The Scripps Research Institute (TS...
In DepthDetails PCBioAssay