BDBM62568 2-(2,3-Dimethyl-phenylamino)-nicotinic acid::2-(2,3-dimethylanilino)-3-pyridinecarboxylic acid::2-(2,3-dimethylanilino)nicotinic acid::2-(2,3-dimethylanilino)pyridine-3-carboxylic acid::2-[(2,3-dimethylphenyl)amino]pyridine-3-carboxylic acid::MLS000068736::Nixylic acid::SMR000003407::cid_71827
SMILES Cc1cccc(Nc2ncccc2C(O)=O)c1C
InChI Key InChIKey=XEQIPELDMSEBJG-UHFFFAOYSA-N
Data  1 EC50
  Tab Delimited (TSV)   2D SDfile   Computed 3D by Vconf -m prep SDfile
Find this compound or compounds like it in BindingDB:
Activity Spreadsheet -- Enzyme Inhibition Constant Data from BindingDB
Found 1 hit for monomerid = 62568
TargetHeat shock factor protein 1(Mus musculus)
Broad Institute
Curated by PubChem BioAssay
LigandPNGBDBM62568(2-(2,3-Dimethyl-phenylamino)-nicotinic acid | 2-(2...)
Affinity DataEC50: >1.95E+5nM. Assay description: Keywords: Heat Shock Factor-1 (HSF-1), Stress Response, MG132, NIH3T3, Luminescence Assay Overview: Modified NIH3T3, transformed to express firefly...
In DepthDetails PCBioAssay