BDBM62766 MLS000062853::N-[4-[4-(4-hydroxyphenyl)-1-piperazinyl]phenyl]carbamic acid phenyl ester::N-[4-[4-(4-hydroxyphenyl)piperazino]phenyl]carbamic acid phenyl ester::SMR000073777::cid_1317528::phenyl N-[4-[4-(4-hydroxyphenyl)piperazin-1-yl]phenyl]carbamate::phenyl {4-[4-(4-hydroxyphenyl)-1-piperazinyl]phenyl}carbamate
SMILES Oc1ccc(cc1)N1CCN(CC1)c1ccc(NC(=O)Oc2ccccc2)cc1
InChI Key InChIKey=IKRKMYDCUZYKHX-UHFFFAOYSA-N
Data  1 EC50
  Tab Delimited (TSV)   2D SDfile   Computed 3D by Vconf -m prep SDfile
Find this compound or compounds like it in BindingDB:
Activity Spreadsheet -- Enzyme Inhibition Constant Data from BindingDB
Found 1 hit for monomerid = 62766
TargetHeat shock factor protein 1(Mus musculus)
Broad Institute
Curated by PubChem BioAssay
LigandPNGBDBM62766(MLS000062853 | N-[4-[4-(4-hydroxyphenyl)-1-piperaz...)
Affinity DataEC50: >1.95E+5nM. Assay description: Keywords: Heat Shock Factor-1 (HSF-1), Stress Response, MG132, NIH3T3, Luminescence Assay Overview: Modified NIH3T3, transformed to express firefly...
In DepthDetails PCBioAssay