BDBM63479 MLS000683949::N-[2-[(3,5-dimethylanilino)-oxomethyl]phenyl]carbamic acid ethyl ester::N-[2-[(3,5-dimethylphenyl)carbamoyl]phenyl]carbamic acid ethyl ester::SMR000295700::cid_935252::ethyl (2-{[(3,5-dimethylphenyl)amino]carbonyl}phenyl)carbamate::ethyl N-[2-[(3,5-dimethylphenyl)carbamoyl]phenyl]carbamate
SMILES CCOC(=O)Nc1ccccc1C(=O)Nc1cc(C)cc(C)c1
InChI Key InChIKey=GVMYBYCRQPWGAZ-UHFFFAOYSA-N
Data  1 EC50
  Tab Delimited (TSV)   2D SDfile   Computed 3D by Vconf -m prep SDfile
Find this compound or compounds like it in BindingDB:
Activity Spreadsheet -- Enzyme Inhibition Constant Data from BindingDB
Found 1 hit for monomerid = 63479
TargetHeat shock factor protein 1(Mus musculus)
Broad Institute
Curated by PubChem BioAssay
LigandPNGBDBM63479(MLS000683949 | N-[2-[(3,5-dimethylanilino)-oxometh...)
Affinity DataEC50: >1.95E+5nM. Assay description: Keywords: Heat Shock Factor-1 (HSF-1), Stress Response, MG132, NIH3T3, Luminescence Assay Overview: Modified NIH3T3, transformed to express firefly...
In DepthDetails PCBioAssay