BDBM63613 4-(benzyloxycarbonylaminomethyl)benzoic acid::4-(phenylmethoxycarbonylaminomethyl)benzoic acid::4-({[(benzyloxy)carbonyl]amino}methyl)benzenecarboxylic acid::MLS000736027::SMR000338577::cid_1479997
SMILES OC(=O)c1ccc(CNC(=O)OCc2ccccc2)cc1
InChI Key InChIKey=QWHYEFZPTSTTSR-UHFFFAOYSA-N
Data  1 EC50
  Tab Delimited (TSV)   2D SDfile   Computed 3D by Vconf -m prep SDfile
Find this compound or compounds like it in BindingDB:
Activity Spreadsheet -- Enzyme Inhibition Constant Data from BindingDB
Found 1 hit for monomerid = 63613
TargetHeat shock factor protein 1(Mus musculus)
Broad Institute
Curated by PubChem BioAssay
LigandPNGBDBM63613(4-(benzyloxycarbonylaminomethyl)benzoic acid | 4-(...)
Affinity DataEC50: >1.95E+5nM. Assay description: Keywords: Heat Shock Factor-1 (HSF-1), Stress Response, MG132, NIH3T3, Luminescence Assay Overview: Modified NIH3T3, transformed to express firefly...
In DepthDetails PCBioAssay