BDBM63981 (4-Hydroxy-1,2,5-trimethyl-piperidin-4-yl)-phenyl-acetic acid methyl ester::2-(4-hydroxy-1,2,5-trimethyl-4-piperidinyl)-2-phenylacetic acid methyl ester::2-(4-hydroxy-1,2,5-trimethyl-4-piperidyl)-2-phenyl-acetic acid methyl ester::MLS001211364::SMR000516688::cid_551073::methyl 2-(4-hydroxy-1,2,5-trimethylpiperidin-4-yl)-2-phenylacetate::methyl 2-phenyl-2-(1,2,5-trimethyl-4-oxidanyl-piperidin-4-yl)ethanoate
SMILES COC(=O)C(c1ccccc1)C1(O)CC(C)N(C)CC1C
InChI Key InChIKey=XGFOAXWEGYBKCA-UHFFFAOYSA-N
Data  1 EC50
  Tab Delimited (TSV)   2D SDfile   Computed 3D by Vconf -m prep SDfile
Find this compound or compounds like it in BindingDB:
Activity Spreadsheet -- Enzyme Inhibition Constant Data from BindingDB
Found 1 hit for monomerid = 63981
TargetHeat shock factor protein 1(Mus musculus)
Broad Institute
Curated by PubChem BioAssay
LigandPNGBDBM63981((4-Hydroxy-1,2,5-trimethyl-piperidin-4-yl)-phenyl-...)
Affinity DataEC50: >1.95E+5nM. Assay description: Keywords: Heat Shock Factor-1 (HSF-1), Stress Response, MG132, NIH3T3, Luminescence Assay Overview: Modified NIH3T3, transformed to express firefly...
In DepthDetails PCBioAssay