BDBM64171 2-(1-naphthalenyl)-4-quinolinecarboxylic acid::2-(1-naphthyl)cinchoninic acid::2-naphthalen-1-ylquinoline-4-carboxylic acid::MLS001172134::SMR000596238::cid_230606
SMILES OC(=O)c1cc(nc2ccccc12)-c1cccc2ccccc12
InChI Key InChIKey=BALYMJPYABUHGF-UHFFFAOYSA-N
Data  1 EC50
  Tab Delimited (TSV)   2D SDfile   Computed 3D by Vconf -m prep SDfile
Find this compound or compounds like it in BindingDB:
Activity Spreadsheet -- Enzyme Inhibition Constant Data from BindingDB
Found 1 hit for monomerid = 64171
TargetHeat shock factor protein 1(Mus musculus)
Broad Institute
Curated by PubChem BioAssay
LigandPNGBDBM64171(2-(1-naphthalenyl)-4-quinolinecarboxylic acid | 2-...)
Affinity DataEC50: >1.95E+5nM. Assay description: Keywords: Heat Shock Factor-1 (HSF-1), Stress Response, MG132, NIH3T3, Luminescence Assay Overview: Modified NIH3T3, transformed to express firefly...
In DepthDetails PCBioAssay