BDBM64186 7,8-dimethyl-4-[[methyl-[(4-methylsulfanylphenyl)methyl]amino]methyl]chromen-2-one::7,8-dimethyl-4-[[methyl-[4-(methylthio)benzyl]amino]methyl]coumarin::7,8-dimethyl-4-[[methyl-[[4-(methylthio)phenyl]methyl]amino]methyl]-1-benzopyran-2-one::MLS001174274::SMR000589057::cid_2690043
SMILES CSc1ccc(CN(C)Cc2cc(=O)oc3c(C)c(C)ccc23)cc1
InChI Key InChIKey=KGVLCXYELREGMQ-UHFFFAOYSA-N
Data  1 EC50
  Tab Delimited (TSV)   2D SDfile   Computed 3D by Vconf -m prep SDfile
Find this compound or compounds like it in BindingDB:
Activity Spreadsheet -- Enzyme Inhibition Constant Data from BindingDB
Found 1 hit for monomerid = 64186
TargetHeat shock factor protein 1(Mus musculus)
Broad Institute
Curated by PubChem BioAssay
LigandPNGBDBM64186(7,8-dimethyl-4-[[methyl-[(4-methylsulfanylphenyl)m...)
Affinity DataEC50: >1.95E+5nM. Assay description: Keywords: Heat Shock Factor-1 (HSF-1), Stress Response, MG132, NIH3T3, Luminescence Assay Overview: Modified NIH3T3, transformed to express firefly...
In DepthDetails PCBioAssay