BDBM64194 4-[[[2-(2-furoylamino)-3-methyl-butanoyl]amino]methyl]benzoic acid methyl ester::4-[[[2-[[2-furanyl(oxo)methyl]amino]-3-methyl-1-oxobutyl]amino]methyl]benzoic acid methyl ester::MLS001176793::SMR000596293::cid_16331615::methyl 4-[[[2-(furan-2-carbonylamino)-3-methylbutanoyl]amino]methyl]benzoate::methyl 4-[[[2-(furan-2-ylcarbonylamino)-3-methyl-butanoyl]amino]methyl]benzoate
SMILES COC(=O)c1ccc(CNC(=O)C(NC(=O)c2ccco2)C(C)C)cc1
InChI Key InChIKey=UOUIUOIISCZQML-UHFFFAOYSA-N
Data  1 EC50
  Tab Delimited (TSV)   2D SDfile   Computed 3D by Vconf -m prep SDfile
Find this compound or compounds like it in BindingDB:
Activity Spreadsheet -- Enzyme Inhibition Constant Data from BindingDB
Found 1 hit for monomerid = 64194
TargetHeat shock factor protein 1(Mus musculus)
Broad Institute
Curated by PubChem BioAssay
LigandPNGBDBM64194(4-[[[2-(2-furoylamino)-3-methyl-butanoyl]amino]met...)
Affinity DataEC50: >1.95E+5nM. Assay description: Keywords: Heat Shock Factor-1 (HSF-1), Stress Response, MG132, NIH3T3, Luminescence Assay Overview: Modified NIH3T3, transformed to express firefly...
In DepthDetails PCBioAssay