BDBM64929 5-hydroxy-2-methyl-1-phenyl-3-indolecarboxylic acid methyl ester::5-hydroxy-2-methyl-1-phenyl-indole-3-carboxylic acid methyl ester::MLS000085210::SMR000019750::cid_3237314::methyl 2-methyl-5-oxidanyl-1-phenyl-indole-3-carboxylate::methyl 5-hydroxy-2-methyl-1-phenyl-1H-indole-3-carboxylate::methyl 5-hydroxy-2-methyl-1-phenylindole-3-carboxylate
SMILES COC(=O)c1c(C)n(-c2ccccc2)c2ccc(O)cc12
InChI Key InChIKey=TZVSNBUGRJWZJS-UHFFFAOYSA-N
Data  1 EC50
  Tab Delimited (TSV)   2D SDfile   Computed 3D by Vconf -m prep SDfile
Find this compound or compounds like it in BindingDB:
Activity Spreadsheet -- Enzyme Inhibition Constant Data from BindingDB
Found 1 hit for monomerid = 64929
TargetATP-dependent molecular chaperone HSP82(Candida albicans)
Broad Institute
Curated by PubChem BioAssay
LigandPNGBDBM64929(5-hydroxy-2-methyl-1-phenyl-3-indolecarboxylic aci...)
Affinity DataEC50:  3.16E+3nM. Assay description: Broad Institute: Reversing Antifungal Drug Resistance Project ID: 2037 Keywords: Candida albicans, drug resistance, Fluconazole, Hsp90, Calcineurin, ...
In DepthDetails PCBioAssay