BDBM66307 2-phenylacetic acid (3-succinimidophenyl) ester::2-phenylacetic acid [3-(2,5-dioxo-1-pyrrolidinyl)phenyl] ester::MLS000113245::SMR000109149::[3-(2,5-dioxopyrrolidin-1-yl)phenyl] 2-phenylacetate::[3-[2,5-bis(oxidanylidene)pyrrolidin-1-yl]phenyl] 2-phenylethanoate::cid_804136
SMILES Oc1ccc(O)n1-c1cccc(OC(=O)Cc2ccccc2)c1
InChI Key InChIKey=UXVOKJJPJHZUOJ-UHFFFAOYSA-N
Data  1 EC50
  Tab Delimited (TSV)   2D SDfile   Computed 3D by Vconf -m prep SDfile
Find this compound or compounds like it in BindingDB:
Activity Spreadsheet -- Enzyme Inhibition Constant Data from BindingDB
Found 1 hit for monomerid = 66307
TargetBcl-2-like protein 11(Homo sapiens (Human))
Broad Institute
Curated by PubChem BioAssay
LigandPNGBDBM66307(2-phenylacetic acid (3-succinimidophenyl) ester | ...)
Affinity DataEC50: >3.50E+5nM. Assay description: Keywords: apoptosis, BH3 domain, Bcl2-A1, BIM, caspase, cancer Primary Collaborator: Todd Golub, Broad Institute, golub@broadinstitute.org Assay Over...
Ligand InfoPC cidPC sid
In DepthDetails PCBioAssay