BDBM66338 1-(4-methoxy-3-methyl-benzyl)-2-methyl-piperidine::1-(4-methoxy-3-methylbenzyl)-2-methylpiperidine::1-[(4-methoxy-3-methyl-phenyl)methyl]-2-methyl-piperidine::1-[(4-methoxy-3-methylphenyl)methyl]-2-methylpiperidine::MLS000532570::SMR000137509::cid_2845664
SMILES COc1ccc(CN2CCCCC2C)cc1C
InChI Key InChIKey=MKJXJNCXFZHYPV-UHFFFAOYSA-N
Data  1 IC50  2 EC50
  Tab Delimited (TSV)   2D SDfile   Computed 3D by Vconf -m prep SDfile
Find this compound or compounds like it in BindingDB:
Activity Spreadsheet -- Enzyme Inhibition Constant Data from BindingDB
Found 3 hits for monomerid = 66338
TargetBcl-2-like protein 11(Homo sapiens (Human))
Broad Institute
Curated by PubChem BioAssay
LigandPNGBDBM66338(1-(4-methoxy-3-methyl-benzyl)-2-methyl-piperidine ...)
Affinity DataEC50: >3.50E+5nM. Assay description: Keywords: apoptosis, BH3 domain, Bcl2-A1, BIM, caspase, cancer Primary Collaborator: Todd Golub, Broad Institute, golub@broadinstitute.org Assay Over...
In DepthDetails PCBioAssay
TargetCorticotropin-releasing factor-binding protein(Homo sapiens (Human))
Burnham Center For Chemical Genomics
Curated by PubChem BioAssay
LigandPNGBDBM66338(1-(4-methoxy-3-methyl-benzyl)-2-methyl-piperidine ...)
Affinity DataIC50:  2.00E+4nM
In DepthDetails PCBioAssay
TargetCorticotropin-releasing factor-binding protein(Homo sapiens (Human))
Burnham Center For Chemical Genomics
Curated by PubChem BioAssay
LigandPNGBDBM66338(1-(4-methoxy-3-methyl-benzyl)-2-methyl-piperidine ...)
Affinity DataEC50:  2.45E+3nM. Assay description: Data Source: Sanford-Burnham Center for Chemical Genomics (SBCCG) Source Affiliation: Sanford-Burnham Medical Research Institute (SBMRI, San Diego, C...
In DepthDetails PCBioAssay