BDBM66613 4-[(1-acetyl-3,4-dihydro-2H-quinolin-6-yl)sulfonylamino]benzoic acid ethyl ester::MLS000876927::SMR000026848::cid_3242822::ethyl 4-[(1-acetyl-3,4-dihydro-2H-quinolin-6-yl)sulfonylamino]benzoate::ethyl 4-[(1-ethanoyl-3,4-dihydro-2H-quinolin-6-yl)sulfonylamino]benzoate::ethyl 4-{[(1-acetyl-1,2,3,4-tetrahydroquinolin-6-yl)sulfonyl]amino}benzoate
SMILES CCOC(=O)c1ccc(NS(=O)(=O)c2ccc3N(CCCc3c2)C(C)=O)cc1
InChI Key InChIKey=IPYFRVYXPVUONP-UHFFFAOYSA-N
Data  1 EC50
  Tab Delimited (TSV)   2D SDfile   Computed 3D by Vconf -m prep SDfile
Find this compound or compounds like it in BindingDB:
Activity Spreadsheet -- Enzyme Inhibition Constant Data from BindingDB
Found 1 hit for monomerid = 66613
TargetBcl-2-like protein 11(Homo sapiens (Human))
Broad Institute
Curated by PubChem BioAssay
LigandPNGBDBM66613(4-[(1-acetyl-3,4-dihydro-2H-quinolin-6-yl)sulfonyl...)
Affinity DataEC50: >3.50E+5nM. Assay description: Keywords: apoptosis, BH3 domain, Bcl2-A1, BIM, caspase, cancer Primary Collaborator: Todd Golub, Broad Institute, golub@broadinstitute.org Assay Over...
In DepthDetails PCBioAssay