BDBM67354 5-chloranyl-N-[4-[methyl(phenyl)sulfamoyl]phenyl]-2-methylsulfonyl-pyrimidine-4-carboxamide::5-chloro-2-mesyl-N-[4-[methyl(phenyl)sulfamoyl]phenyl]pyrimidine-4-carboxamide::5-chloro-N-[4-[methyl(phenyl)sulfamoyl]phenyl]-2-methylsulfonyl-4-pyrimidinecarboxamide::5-chloro-N-[4-[methyl(phenyl)sulfamoyl]phenyl]-2-methylsulfonylpyrimidine-4-carboxamide::MLS001116367::SMR000625581::cid_16012865
SMILES CN(c1ccccc1)S(=O)(=O)c1ccc(NC(=O)c2nc(ncc2Cl)S(C)(=O)=O)cc1
InChI Key InChIKey=GVDDPQRQWABRJN-UHFFFAOYSA-N
Data  4 IC50
  Tab Delimited (TSV)   2D SDfile   Computed 3D by Vconf -m prep SDfile
Find this compound or compounds like it in BindingDB:
Activity Spreadsheet -- Enzyme Inhibition Constant Data from BindingDB
Found 4 hits for monomerid = 67354
TargetApelin receptor(Homo sapiens (Human))
Sanford-Burnham Center For Chemical Genomics
Curated by PubChem BioAssay
LigandPNGBDBM67354(5-chloranyl-N-[4-[methyl(phenyl)sulfamoyl]phenyl]-...)
Affinity DataIC50:  4.01E+3nM. Assay description: Data Source: Sanford-Burnham Center for Chemical Genomics (SBCCG) Source Affiliation: Sanford- Sanford-Burnham Medical Research Institute(SBMRI, San...
In DepthDetails PCBioAssay
TargetBeta-lactamase(Pseudomonas aeruginosa)
The Scripps Research Institute Molecular Screening Center
Curated by PubChem BioAssay
LigandPNGBDBM67354(5-chloranyl-N-[4-[methyl(phenyl)sulfamoyl]phenyl]-...)
Affinity DataIC50:  5.74E+3nM. Assay description: Source (MLPCN Center Name): The Scripps Research Institute Molecular Screening Center (SRIMSC) Affiliation: The Scripps Research Institute, TSRI Assa...
In DepthDetails PCBioAssay
TargetToll-like receptor 9(Homo sapiens (Human))
The Scripps Research Institute Molecular Screening Center
Curated by PubChem BioAssay
LigandPNGBDBM67354(5-chloranyl-N-[4-[methyl(phenyl)sulfamoyl]phenyl]-...)
Affinity DataIC50:  6.17E+3nM. Assay description: Source (MLPCN Center Name): The Scripps Research Institute Molecular Screening Center (SRIMSC) Affiliation: The Scripps Research Institute, TSRI Assa...
In DepthDetails PCBioAssay
TargetType-1 angiotensin II receptor(Homo sapiens (Human))
Burnham Center For Chemical Genomics
Curated by PubChem BioAssay
LigandPNGBDBM67354(5-chloranyl-N-[4-[methyl(phenyl)sulfamoyl]phenyl]-...)
Affinity DataIC50:  3.14E+3nM. Assay description: Data Source: Sanford-Burnham Center for Chemical Genomics (SBCCG) Source Affiliation: Sanford-Burnham Medical Research Institute(SBMRI, San Diego, C...
In DepthDetails PCBioAssay