BDBM67834 (4-isobutoxyphenyl)(phenyl)methanone oxime::(4-isobutoxyphenyl)-phenyl-methanone oxime::MLS000532119::N-[[4-(2-methylpropoxy)phenyl]-phenyl-methylidene]hydroxylamine::N-[[4-(2-methylpropoxy)phenyl]-phenylmethylidene]hydroxylamine::SMR000137060::[4-(2-methylpropoxy)phenyl]-phenylmethanone oxime::cid_704274
SMILES CC(C)COc1ccc(cc1)C(N=O)c1ccccc1
InChI Key InChIKey=BBGUMNSTWGBQKZ-UHFFFAOYSA-N
Data  3 IC50
  Tab Delimited (TSV)   2D SDfile   Computed 3D by Vconf -m prep SDfile
Find this compound or compounds like it in BindingDB:
Activity Spreadsheet -- Enzyme Inhibition Constant Data from BindingDB
Found 3 hits for monomerid = 67834
TargetDNA damage-inducible transcript 3 protein(Mus musculus)
Emory University
Curated by PubChem BioAssay
LigandPNGBDBM67834((4-isobutoxyphenyl)(phenyl)methanone oxime | (4-is...)
Affinity DataIC50:  7.38E+3nM. Assay description: NIH Molecular Libraries Screening Centers Network [MLSCN] Emory Chemical Biology Discovery Center in MLSCN Assay provider: Dr. Randal Kaufman, Univer...
In DepthDetails PCBioAssay
TargetDNA damage-inducible transcript 3 protein(Mus musculus)
Emory University
Curated by PubChem BioAssay
LigandPNGBDBM67834((4-isobutoxyphenyl)(phenyl)methanone oxime | (4-is...)
Affinity DataIC50:  7.38E+3nM. Assay description: NIH Molecular Libraries Screening Centers Network [MLSCN] Emory Chemical Biology Discovery Center in MLSCN Assay provider: Dr. Randal Kaufman, Univer...
In DepthDetails PCBioAssay
TargetX-box-binding protein 1(Homo sapiens (Human))
Emory University
Curated by PubChem BioAssay
LigandPNGBDBM67834((4-isobutoxyphenyl)(phenyl)methanone oxime | (4-is...)
Affinity DataIC50:  6.89E+3nM. Assay description: NIH Molecular Libraries Screening Centers Network [MLSCN] Emory Chemical Biology Discovery Center in MLSCN Assay provider: Dr. Randal Kaufman, Univer...
In DepthDetails PCBioAssay