BDBM68392 4-(benzyloxycarbonylamino)cyclohexanecarboxylic acid::4-(phenylmethoxycarbonylamino)-1-cyclohexanecarboxylic acid::4-(phenylmethoxycarbonylamino)cyclohexane-1-carboxylic acid::MLS000038274::SMR000038295::cid_285247
SMILES OC(=O)C1CCC(CC1)NC(=O)OCc1ccccc1
InChI Key InChIKey=ZVMICQYOGWAOSU-UHFFFAOYSA-N
Data  1 EC50
  Tab Delimited (TSV)   2D SDfile   Computed 3D by Vconf -m prep SDfile
Find this compound or compounds like it in BindingDB:
Activity Spreadsheet -- Enzyme Inhibition Constant Data from BindingDB
Found 1 hit for monomerid = 68392
TargetGlycogen synthase kinase-3 beta(Homo sapiens (Human))
Broad Institute
Curated by PubChem BioAssay
LigandPNGBDBM68392(4-(benzyloxycarbonylamino)cyclohexanecarboxylic ac...)
Affinity DataEC50: >3.00E+5nM. Assay description: Keywords: GSK3beta, dose response, kinase, inhibition, HTS Assay Overview: The glycogen synthase kinase-3 beta (GSK-3b) is a known master regulator f...
In DepthDetails PCBioAssay