BDBM68751 MLS000535174::SMR000142610::cid_1314305::methyl {[5-(4-morpholinyl)-1,2,3,4-tetrahydropyrimido[4',5':4,5]thieno[2,3-c]isoquinolin-8-yl]thio}acetate
SMILES COC(=O)CSc1ncnc2c1sc1nc(N3CCOCC3)c3CCCCc3c21
InChI Key InChIKey=MBIKWKCJOBYLIT-UHFFFAOYSA-N
Data  1 EC50
  Tab Delimited (TSV)   2D SDfile   Computed 3D by Vconf -m prep SDfile
Find this compound or compounds like it in BindingDB:
Activity Spreadsheet -- Enzyme Inhibition Constant Data from BindingDB
Found 1 hit for monomerid = 68751
TargetGlycogen synthase kinase-3 beta(Homo sapiens (Human))
Broad Institute
Curated by PubChem BioAssay
LigandPNGBDBM68751(MLS000535174 | SMR000142610 | cid_1314305 | methyl...)
Affinity DataEC50: >3.00E+5nM. Assay description: Keywords: GSK3beta, dose response, kinase, inhibition, HTS Assay Overview: The glycogen synthase kinase-3 beta (GSK-3b) is a known master regulator f...
In DepthDetails PCBioAssay