BDBM69512 (2-amino-2-oxoethyl) 4-(4-hydroxyphenyl)benzoate::(2-azanyl-2-oxidanylidene-ethyl) 4-(4-hydroxyphenyl)benzoate::4-(4-hydroxyphenyl)benzoic acid (2-amino-2-keto-ethyl) ester::4-(4-hydroxyphenyl)benzoic acid (2-amino-2-oxoethyl) ester::MLS001002077::SMR000368201::cid_2459977
SMILES NC(=O)COC(=O)c1ccc(cc1)-c1ccc(O)cc1
InChI Key InChIKey=ZBAZBFXMQLNOIL-UHFFFAOYSA-N
Data  2 EC50
  Tab Delimited (TSV)   2D SDfile   Computed 3D by Vconf -m prep SDfile
Find this compound or compounds like it in BindingDB:
Activity Spreadsheet -- Enzyme Inhibition Constant Data from BindingDB
Found 2 hits for monomerid = 69512
TargetCorticotropin-releasing factor-binding protein(Homo sapiens (Human))
Burnham Center For Chemical Genomics
Curated by PubChem BioAssay
LigandPNGBDBM69512((2-amino-2-oxoethyl) 4-(4-hydroxyphenyl)benzoate |...)
Affinity DataEC50: >5.30E+4nM. Assay description: Data Source: Sanford-Burnham Center for Chemical Genomics (SBCCG) Source Affiliation: Sanford-Burnham Medical Research Institute (SBMRI, San Diego, C...
In DepthDetails PCBioAssay
TargetGlycogen synthase kinase-3 beta(Homo sapiens (Human))
Broad Institute
Curated by PubChem BioAssay
LigandPNGBDBM69512((2-amino-2-oxoethyl) 4-(4-hydroxyphenyl)benzoate |...)
Affinity DataEC50: >3.00E+5nM. Assay description: Keywords: GSK3beta, dose response, kinase, inhibition, HTS Assay Overview: The glycogen synthase kinase-3 beta (GSK-3b) is a known master regulator f...
In DepthDetails PCBioAssay