BDBM69626 (3-benzoyl-1-benzofuran-5-yl) acetate::3-benzoyl-1-benzofuran-5-yl acetate::MLS001179149::SMR000476349::[3-(phenylcarbonyl)-1-benzofuran-5-yl] ethanoate::acetic acid (3-benzoyl-5-benzofuranyl) ester::acetic acid (3-benzoylbenzofuran-5-yl) ester::cid_878744
SMILES CC(=O)Oc1ccc2occ(C(=O)c3ccccc3)c2c1
InChI Key InChIKey=PQRYSZJYVASVHX-UHFFFAOYSA-N
Data  1 IC50  1 EC50
  Tab Delimited (TSV)   2D SDfile   Computed 3D by Vconf -m prep SDfile
Find this compound or compounds like it in BindingDB:
Activity Spreadsheet -- Enzyme Inhibition Constant Data from BindingDB
Found 2 hits for monomerid = 69626
TargetNAD-dependent protein deacetylase sirtuin-1(Homo sapiens (Human))
Chinese Academy Of Sciences
Curated by ChEMBL
LigandPNGBDBM69626((3-benzoyl-1-benzofuran-5-yl) acetate | 3-benzoyl-...)
Affinity DataIC50: >3.00E+5nM. Assay description: Inhibition of N-terminal His6-tagged SIRT1 coding region (156-664) (unknown origin) expressed in Escherichia coli BL21(DE3) using 31.25 uM ac-RHKKac-...
In DepthDetails ArticlePubMed
TargetGlycogen synthase kinase-3 beta(Homo sapiens (Human))
Broad Institute
Curated by PubChem BioAssay
LigandPNGBDBM69626((3-benzoyl-1-benzofuran-5-yl) acetate | 3-benzoyl-...)
Affinity DataEC50: >3.00E+5nM. Assay description: Keywords: GSK3beta, dose response, kinase, inhibition, HTS Assay Overview: The glycogen synthase kinase-3 beta (GSK-3b) is a known master regulator f...
In DepthDetails PCBioAssay