BDBM69676 1-[3-(2-Phenyl-quinazolin-4-ylamino)-phenyl]-ethanone::1-[3-[(2-phenyl-4-quinazolinyl)amino]phenyl]ethanone;hydrochloride::1-[3-[(2-phenylquinazolin-4-yl)amino]phenyl]ethanone;hydrochloride::MLS001210730::SMR000516691::cid_2789504
SMILES CC(=O)c1cccc(Nc2nc(nc3ccccc23)-c2ccccc2)c1
InChI Key InChIKey=IVEZQOPVGUKFEO-UHFFFAOYSA-N
Data  1 EC50
  Tab Delimited (TSV)   2D SDfile   Computed 3D by Vconf -m prep SDfile
Find this compound or compounds like it in BindingDB:
Activity Spreadsheet -- Enzyme Inhibition Constant Data from BindingDB
Found 1 hit for monomerid = 69676
TargetGlycogen synthase kinase-3 beta(Homo sapiens (Human))
Broad Institute
Curated by PubChem BioAssay
LigandPNGBDBM69676(1-[3-(2-Phenyl-quinazolin-4-ylamino)-phenyl]-ethan...)
Affinity DataEC50: >3.00E+5nM. Assay description: Keywords: GSK3beta, dose response, kinase, inhibition, HTS Assay Overview: The glycogen synthase kinase-3 beta (GSK-3b) is a known master regulator f...
In DepthDetails PCBioAssay