BDBM69827 3-(4-methoxybenzoyl)-1-benzofuran-5-yl acetate::MLS001196790::SMR000555952::[3-(4-methoxybenzoyl)-1-benzofuran-5-yl] acetate::[3-(4-methoxyphenyl)carbonyl-1-benzofuran-5-yl] ethanoate::acetic acid (3-p-anisoylbenzofuran-5-yl) ester::acetic acid [3-[(4-methoxyphenyl)-oxomethyl]-5-benzofuranyl] ester::cid_868434
SMILES COc1ccc(cc1)C(=O)c1coc2ccc(OC(C)=O)cc12
InChI Key InChIKey=XMDUWIYGGLYSPZ-UHFFFAOYSA-N
Data  1 EC50
  Tab Delimited (TSV)   2D SDfile   Computed 3D by Vconf -m prep SDfile
Find this compound or compounds like it in BindingDB:
Activity Spreadsheet -- Enzyme Inhibition Constant Data from BindingDB
Found 1 hit for monomerid = 69827
TargetGlycogen synthase kinase-3 beta(Homo sapiens (Human))
Broad Institute
Curated by PubChem BioAssay
LigandPNGBDBM69827(3-(4-methoxybenzoyl)-1-benzofuran-5-yl acetate | M...)
Affinity DataEC50: >3.00E+5nM. Assay description: Keywords: GSK3beta, dose response, kinase, inhibition, HTS Assay Overview: The glycogen synthase kinase-3 beta (GSK-3b) is a known master regulator f...
In DepthDetails PCBioAssay