BDBM71467 5-Methyl-2H-pyrazole-3-carboxylic acid (5-hydroxy-3-methyl-1-phenyl-1H-pyrazol-4-ylmethylene)-hydrazide::5-methyl-N'-[(Z)-(3-methyl-5-oxidanylidene-1-phenyl-pyrazol-4-ylidene)methyl]-1H-pyrazole-3-carbohydrazide::5-methyl-N'-[(Z)-(3-methyl-5-oxo-1-phenyl-4-pyrazolylidene)methyl]-1H-pyrazole-3-carbohydrazide::5-methyl-N'-[(Z)-(3-methyl-5-oxo-1-phenylpyrazol-4-ylidene)methyl]-1H-pyrazole-3-carbohydrazide::MLS001219517::N'-[(Z)-(5-keto-3-methyl-1-phenyl-2-pyrazolin-4-ylidene)methyl]-5-methyl-1H-pyrazole-3-carbohydrazide::SMR000611152::cid_5765297
SMILES Cc1cc([nH]n1)C(=O)NN=Cc1c(C)[nH]n(-c2ccccc2)c1=O
InChI Key InChIKey=AQHGKOVHWKQVIE-RQZCQDPDSA-N
Data  3 IC50
  Tab Delimited (TSV)   2D SDfile   Computed 3D by Vconf -m prep SDfile
Find this compound or compounds like it in BindingDB:
Activity Spreadsheet -- Enzyme Inhibition Constant Data from BindingDB
Found 3 hits for monomerid = 71467
TargetCaspase-9(Homo sapiens (Human))
Burnham Center For Chemical Genomics
Curated by PubChem BioAssay
LigandPNGBDBM71467(5-Methyl-2H-pyrazole-3-carboxylic acid (5-hydroxy-...)
Affinity DataIC50:  3.19E+3nM. Assay description: Data Source: Sanford-Burnham Center for Chemical Genomics (SBCCG) Source Affiliation: Sanford-Burnham Medical Research Institute (SBIMR, San Diego, C...
Ligand InfoPC cidPC sid
In DepthDetails PCBioAssay
TargetApoptotic protease-activating factor 1(Homo sapiens (Human))
Burnham Center For Chemical Genomics
Curated by PubChem BioAssay
LigandPNGBDBM71467(5-Methyl-2H-pyrazole-3-carboxylic acid (5-hydroxy-...)
Affinity DataIC50: >1.00E+5nM. Assay description: Data Source: Sanford-Burnham Center for Chemical Genomics (SBCCG) Source Affiliation: Sanford-Burnham Medical Research Institute (SBIMR, San Diego, C...
Ligand InfoPC cidPC sid
In DepthDetails PCBioAssay
TargetApoptotic protease-activating factor 1(Homo sapiens (Human))
Burnham Center For Chemical Genomics
Curated by PubChem BioAssay
LigandPNGBDBM71467(5-Methyl-2H-pyrazole-3-carboxylic acid (5-hydroxy-...)
Affinity DataIC50:  6.97E+3nM. Assay description: Data Source: Sanford-Burnham Center for Chemical Genomics (SBCCG) Source Affiliation: Sanford-Burnham Medical Research Institute (SBIMR, San Diego, C...
Ligand InfoPC cidPC sid
In DepthDetails PCBioAssay