BDBM71754 2-cyclohexyl-1-keto-9-methyl-N-[(5-methyl-2-furyl)methyl]-beta-carboline-4-carboxamide::2-cyclohexyl-9-methyl-N-[(5-methyl-2-furanyl)methyl]-1-oxo-4-pyrido[3,4-b]indolecarboxamide::2-cyclohexyl-9-methyl-N-[(5-methyl-2-furyl)methyl]-1-oxo-2,9-dihydro-1H-beta-carboline-4-carboxamide::2-cyclohexyl-9-methyl-N-[(5-methylfuran-2-yl)methyl]-1-oxidanylidene-pyrido[3,4-b]indole-4-carboxamide::2-cyclohexyl-9-methyl-N-[(5-methylfuran-2-yl)methyl]-1-oxopyrido[3,4-b]indole-4-carboxamide::MLS000091665::SMR000026215::cid_3237751
SMILES Cc1ccc(CNC(=O)c2cn(C3CCCCC3)c(=O)c3n(C)c4ccccc4c23)o1
InChI Key InChIKey=AYGOPVWFLVEGFG-UHFFFAOYSA-N
Data  1 EC50
  Tab Delimited (TSV)   2D SDfile   Computed 3D by Vconf -m prep SDfile
Find this compound or compounds like it in BindingDB:
Activity Spreadsheet -- Enzyme Inhibition Constant Data from BindingDB
Found 1 hit for monomerid = 71754
TargetHeat shock factor protein 1(Mus musculus)
Broad Institute
Curated by PubChem BioAssay
LigandPNGBDBM71754(2-cyclohexyl-1-keto-9-methyl-N-[(5-methyl-2-furyl)...)
Affinity DataEC50:  5.17E+4nM. Assay description: Keywords: Heat Shock Factor-1 (HSF-1), Stress Response, MG132, NIH3T3, Luminescence Assay Overview: Confirmation testing of small molecules identifie...
In DepthDetails PCBioAssay