BDBM71762 4-(carbethoxyamino)-2-hydroxy-benzoic acid phenyl ester::4-(ethoxycarbonylamino)-2-hydroxybenzoic acid phenyl ester::MLS000088482::SMR000024102::cid_717668::phenyl 4-(ethoxycarbonylamino)-2-hydroxybenzoate::phenyl 4-(ethoxycarbonylamino)-2-oxidanyl-benzoate::phenyl 4-[(ethoxycarbonyl)amino]-2-hydroxybenzoate
SMILES CCOC(=O)Nc1ccc(C(=O)Oc2ccccc2)c(O)c1
InChI Key InChIKey=FAKOKJBRBSMSSZ-UHFFFAOYSA-N
Data  3 IC50  1 EC50
  Tab Delimited (TSV)   2D SDfile   Computed 3D by Vconf -m prep SDfile
Find this compound or compounds like it in BindingDB:
Activity Spreadsheet -- Enzyme Inhibition Constant Data from BindingDB
Found 4 hits for monomerid = 71762
TargetHeat shock factor protein 1(Mus musculus)
Broad Institute
Curated by PubChem BioAssay
LigandPNGBDBM71762(4-(carbethoxyamino)-2-hydroxy-benzoic acid phenyl ...)
Affinity DataEC50:  4.92E+4nM. Assay description: Keywords: Heat Shock Factor-1 (HSF-1), Stress Response, MG132, NIH3T3, Luminescence Assay Overview: Confirmation testing of small molecules identifie...
In DepthDetails PCBioAssay
TargetCaspase-3(Homo sapiens (Human))
Burnham Center For Chemical Genomics
Curated by PubChem BioAssay
LigandPNGBDBM71762(4-(carbethoxyamino)-2-hydroxy-benzoic acid phenyl ...)
Affinity DataIC50:  6.13E+4nM. Assay description: Data Source: Sanford-Burnham Center for Chemical Genomics (SBCCG) Source Affiliation: Sanford-Burnham Medical Research Institute (SBMRI, San Diego, C...
In DepthDetails PCBioAssay
TargetSentrin-specific protease 6(Homo sapiens (Human))
Burnham Center For Chemical Genomics
Curated by PubChem BioAssay
LigandPNGBDBM71762(4-(carbethoxyamino)-2-hydroxy-benzoic acid phenyl ...)
Affinity DataIC50:  4.76E+4nM. Assay description: Data Source: Sanford-Burnham Center for Chemical Genomics (SBCCG) Source Affiliation: Sanford-Burnham Medical Research Institute (SBMRI, San Diego, C...
In DepthDetails PCBioAssay
TargetSentrin-specific protease 8(Homo sapiens (Human))
Burnham Center For Chemical Genomics
Curated by PubChem BioAssay
LigandPNGBDBM71762(4-(carbethoxyamino)-2-hydroxy-benzoic acid phenyl ...)
Affinity DataIC50:  7.99E+4nM. Assay description: Data Source: Sanford-Burnham Center for Chemical Genomics (SBCCG) Source Affiliation: Sanford-Burnham Medical Research Institute (SBMRI, San Diego, C...
In DepthDetails PCBioAssay