BDBM71917 MLS000541297::N-(3-chloro-4-methoxy-benzyl)carbamic acid phenyl ester::N-[(3-chloro-4-methoxyphenyl)methyl]carbamic acid phenyl ester::SMR000126155::cid_1485503::phenyl N-(3-chloro-4-methoxybenzyl)carbamate::phenyl N-[(3-chloranyl-4-methoxy-phenyl)methyl]carbamate::phenyl N-[(3-chloro-4-methoxyphenyl)methyl]carbamate
SMILES COc1ccc(CNC(=O)Oc2ccccc2)cc1Cl
InChI Key InChIKey=OEVWESKDNKRBCO-UHFFFAOYSA-N
Data  1 EC50
  Tab Delimited (TSV)   2D SDfile   Computed 3D by Vconf -m prep SDfile
Find this compound or compounds like it in BindingDB:
Activity Spreadsheet -- Enzyme Inhibition Constant Data from BindingDB
Found 1 hit for monomerid = 71917
TargetHeat shock factor protein 1(Mus musculus)
Broad Institute
Curated by PubChem BioAssay
LigandPNGBDBM71917(MLS000541297 | N-(3-chloro-4-methoxy-benzyl)carbam...)
Affinity DataEC50:  6.23E+4nM. Assay description: Keywords: Heat Shock Factor-1 (HSF-1), Stress Response, MG132, NIH3T3, Luminescence Assay Overview: Confirmation testing of small molecules identifie...
In DepthDetails PCBioAssay