BDBM72137 2-[3-(2-ethoxy-2-keto-ethoxy)-4-[(E)-2-nitrovinyl]phenoxy]acetic acid ethyl ester::2-[3-(2-ethoxy-2-oxoethoxy)-4-[(E)-2-nitroethenyl]phenoxy]acetic acid ethyl ester::MLS000575610::SMR000185749::cid_1040545::diethyl 2,2'-[[4-(2-nitrovinyl)-1,3-phenylene]bis(oxy)]diacetate::ethyl 2-[3-(2-ethoxy-2-oxidanylidene-ethoxy)-4-[(E)-2-nitroethenyl]phenoxy]ethanoate::ethyl 2-[3-(2-ethoxy-2-oxoethoxy)-4-[(E)-2-nitroethenyl]phenoxy]acetate
SMILES CCOC(=O)COc1ccc(\C=C\[N+]([O-])=O)c(OCC(=O)OCC)c1
InChI Key InChIKey=HRYDWTDZCFVFRH-BQYQJAHWSA-N
Data  2 EC50
  Tab Delimited (TSV)   2D SDfile   Computed 3D by Vconf -m prep SDfile
Find this compound or compounds like it in BindingDB:
Activity Spreadsheet -- Enzyme Inhibition Constant Data from BindingDB
Found 2 hits for monomerid = 72137
TargetNeurotensin receptor type 1(Homo sapiens (Human))
Burnham Center For Chemical Genomics
Curated by PubChem BioAssay
LigandPNGBDBM72137(2-[3-(2-ethoxy-2-keto-ethoxy)-4-[(E)-2-nitrovinyl]...)
Affinity DataEC50:  3.89E+3nM. Assay description: Data Source: Sanford-Burnham Center for Chemical Genomics (SBCCG) Source Affiliation: Sanford-Burnham Medical Research Institute (SBMRI, San Diego, C...
In DepthDetails PCBioAssay
TargetHeat shock factor protein 1(Mus musculus)
Broad Institute
Curated by PubChem BioAssay
LigandPNGBDBM72137(2-[3-(2-ethoxy-2-keto-ethoxy)-4-[(E)-2-nitrovinyl]...)
Affinity DataEC50:  6.52E+3nM. Assay description: Keywords: Heat Shock Factor-1 (HSF-1), Stress Response, MG132, NIH3T3, Luminescence Assay Overview: Confirmation testing of small molecules identifie...
In DepthDetails PCBioAssay