BDBM72166 3-[4-Chloro-2-oxo-5-(o-tolyl-hydrazonomethyl)-thiazol-3-ylmethyl]-benzoic acid methyl ester::3-[[4-chloro-2-keto-5-[(E)-(o-tolylhydrazono)methyl]-4-thiazolin-3-yl]methyl]benzoic acid methyl ester::3-[[4-chloro-2-keto-5-[(o-tolylhydrazono)methyl]-4-thiazolin-3-yl]methyl]benzoic acid methyl ester::3-[[4-chloro-5-[[(2-methylphenyl)hydrazinylidene]methyl]-2-oxo-3-thiazolyl]methyl]benzoic acid methyl ester::MLS000589672::SMR000219473::cid_4271960::methyl 3-[[4-chloranyl-5-[[(2-methylphenyl)hydrazinylidene]methyl]-2-oxidanylidene-1,3-thiazol-3-yl]methyl]benzoate::methyl 3-[[4-chloro-5-[[(2-methylphenyl)hydrazinylidene]methyl]-2-oxo-1,3-thiazol-3-yl]methyl]benzoate
SMILES COC(=O)c1cccc(Cn2c(Cl)c(CN=Nc3ccccc3C)sc2=O)c1
InChI Key InChIKey=ZDDMHKWBTJKLLE-UHFFFAOYSA-N
Data  2 IC50  1 EC50
  Tab Delimited (TSV)   2D SDfile   Computed 3D by Vconf -m prep SDfile
Find this compound or compounds like it in BindingDB:
Activity Spreadsheet -- Enzyme Inhibition Constant Data from BindingDB
Found 3 hits for monomerid = 72166
TargetHeat shock factor protein 1(Mus musculus)
Broad Institute
Curated by PubChem BioAssay
LigandPNGBDBM72166(3-[4-Chloro-2-oxo-5-(o-tolyl-hydrazonomethyl)-thia...)
Affinity DataEC50:  6.12E+4nM. Assay description: Keywords: Heat Shock Factor-1 (HSF-1), Stress Response, MG132, NIH3T3, Luminescence Assay Overview: Confirmation testing of small molecules identifie...
In DepthDetails PCBioAssay
TargetDisintegrin and metalloproteinase domain-containing protein 17(Homo sapiens (Human))
The Scripps Research Institute Molecular Screening Center
Curated by PubChem BioAssay
LigandPNGBDBM72166(3-[4-Chloro-2-oxo-5-(o-tolyl-hydrazonomethyl)-thia...)
Affinity DataIC50:  6.95E+4nM. Assay description: Source (MLPCN Center Name): The Scripps Research Institute Molecular Screening Center (SRIMSC) Center Affiliation: Torrey Pines Institute for Molecul...
In DepthDetails PCBioAssay
TargetDisintegrin and metalloproteinase domain-containing protein 10(Homo sapiens (Human))
The Scripps Research Institute Molecular Screening Center
Curated by PubChem BioAssay
LigandPNGBDBM72166(3-[4-Chloro-2-oxo-5-(o-tolyl-hydrazonomethyl)-thia...)
Affinity DataIC50:  6.95E+4nM. Assay description: Source (MLPCN Center Name): The Scripps Research Institute Molecular Screening Center (SRIMSC) Center Affiliation: Torrey Pines Institute for Molecul...
In DepthDetails PCBioAssay