BDBM72289 4-[(5-amino-3-methyl-1-phenyl-4-pyrazolyl)-(4-methylphenyl)methyl]-5-methyl-2-phenyl-3-pyrazolamine::4-[(5-amino-3-methyl-1-phenylpyrazol-4-yl)-(4-methylphenyl)methyl]-5-methyl-2-phenylpyrazol-3-amine::4-[(5-azanyl-3-methyl-1-phenyl-pyrazol-4-yl)-(4-methylphenyl)methyl]-5-methyl-2-phenyl-pyrazol-3-amine::MLS000389978::SMR000256252::[4-[(5-amino-3-methyl-1-phenyl-pyrazol-4-yl)-(p-tolyl)methyl]-5-methyl-2-phenyl-pyrazol-3-yl]amine::cid_4460292
SMILES Cc1nn(c(N)c1C(c1c(C)nn(c1N)-c1ccccc1)c1ccc(C)cc1)-c1ccccc1
InChI Key InChIKey=HHQHGWZZWYVUBK-UHFFFAOYSA-N
Data  1 EC50
  Tab Delimited (TSV)   2D SDfile   Computed 3D by Vconf -m prep SDfile
Find this compound or compounds like it in BindingDB:
Activity Spreadsheet -- Enzyme Inhibition Constant Data from BindingDB
Found 1 hit for monomerid = 72289
TargetHeat shock factor protein 1(Mus musculus)
Broad Institute
Curated by PubChem BioAssay
LigandPNGBDBM72289(4-[(5-amino-3-methyl-1-phenyl-4-pyrazolyl)-(4-meth...)
Affinity DataEC50: >2.60E+5nM. Assay description: Keywords: Heat Shock Factor-1 (HSF-1), Stress Response, MG132, NIH3T3, Luminescence Assay Overview: Confirmation testing of small molecules identifie...
In DepthDetails PCBioAssay