BDBM72467 4-hydroxy-2-(2-oxopropyl)-1-naphthyl benzoate::MLS000673447::SMR000298093::[4-hydroxy-2-(2-oxopropyl)naphthalen-1-yl] benzoate::[4-oxidanyl-2-(2-oxidanylidenepropyl)naphthalen-1-yl] benzoate::benzoic acid (2-acetonyl-4-hydroxy-1-naphthyl) ester::benzoic acid [4-hydroxy-2-(2-oxopropyl)-1-naphthalenyl] ester::cid_878801
SMILES CC(=O)Cc1cc(O)c2ccccc2c1OC(=O)c1ccccc1
InChI Key InChIKey=MHTABERAOBBWMB-UHFFFAOYSA-N
Data  3 IC50  1 EC50
  Tab Delimited (TSV)   2D SDfile   Computed 3D by Vconf -m prep SDfile
Find this compound or compounds like it in BindingDB:
Activity Spreadsheet -- Enzyme Inhibition Constant Data from BindingDB
Found 4 hits for monomerid = 72467
TargetHeat shock factor protein 1(Mus musculus)
Broad Institute
Curated by PubChem BioAssay
LigandPNGBDBM72467(4-hydroxy-2-(2-oxopropyl)-1-naphthyl benzoate | ML...)
Affinity DataEC50: >2.60E+5nM. Assay description: Keywords: Heat Shock Factor-1 (HSF-1), Stress Response, MG132, NIH3T3, Luminescence Assay Overview: Confirmation testing of small molecules identifie...
In DepthDetails PCBioAssay
TargetPerilipin-5(Homo sapiens (Human))
The Scripps Research Institute Molecular Screening Center
Curated by PubChem BioAssay
LigandPNGBDBM72467(4-hydroxy-2-(2-oxopropyl)-1-naphthyl benzoate | ML...)
Affinity DataIC50:  1.96E+3nM
In DepthDetails PCBioAssay
TargetPerilipin-1(Homo sapiens (Human))
The Scripps Research Institute Molecular Screening Center
Curated by PubChem BioAssay
LigandPNGBDBM72467(4-hydroxy-2-(2-oxopropyl)-1-naphthyl benzoate | ML...)
Affinity DataIC50:  2.63E+3nM
In DepthDetails PCBioAssay
TargetHepatocyte nuclear factor 4-alpha(Homo sapiens (Human))
The Scripps Research Institute Molecular Screening Center
Curated by PubChem BioAssay
LigandPNGBDBM72467(4-hydroxy-2-(2-oxopropyl)-1-naphthyl benzoate | ML...)
Affinity DataIC50:  1.46E+4nM
In DepthDetails PCBioAssay