BDBM72810 MLS001164487::SMR000497461::cid_23679228::sodium 4-[benzyl(phenylsulfonyl)amino]benzoate::sodium;4-[(phenylmethyl)-(phenylsulfonyl)amino]benzoate::sodium;4-[benzenesulfonyl(benzyl)amino]benzoate::sodium;4-[benzenesulfonyl-(phenylmethyl)amino]benzoate::sodium;4-[benzyl(besyl)amino]benzoate
SMILES [O-]C(=O)c1ccc(cc1)N(Cc1ccccc1)S(=O)(=O)c1ccccc1
InChI Key InChIKey=YHSUPKGYOKVJGB-UHFFFAOYSA-M
Data  1 EC50
  Tab Delimited (TSV)   2D SDfile   Computed 3D by Vconf -m prep SDfile
Find this compound or compounds like it in BindingDB:
Activity Spreadsheet -- Enzyme Inhibition Constant Data from BindingDB
Found 1 hit for monomerid = 72810
TargetHeat shock factor protein 1(Mus musculus)
Broad Institute
Curated by PubChem BioAssay
LigandPNGBDBM72810(MLS001164487 | SMR000497461 | cid_23679228 | sodiu...)
Affinity DataEC50: >2.60E+5nM. Assay description: Keywords: Heat Shock Factor-1 (HSF-1), Stress Response, MG132, NIH3T3, Luminescence Assay Overview: Confirmation testing of small molecules identifie...
In DepthDetails PCBioAssay