BDBM72983 MLS001030377::N-butyl-4-[[(1-cyclopropylcarbonyl-2-methyl-2,3-dihydroindol-5-yl)sulfonylamino]methyl]-N-methyl-cyclohexane-1-carboxamide::N-butyl-4-[[[1-(cyclopropanecarbonyl)-2-methyl-2,3-dihydroindol-5-yl]sulfonylamino]methyl]-N-methylcyclohexane-1-carboxamide::N-butyl-4-[[[1-(cyclopropanecarbonyl)-2-methyl-indolin-5-yl]sulfonylamino]methyl]-N-methyl-cyclohexanecarboxamide::N-butyl-4-[[[1-[cyclopropyl(oxo)methyl]-2-methyl-2,3-dihydroindol-5-yl]sulfonylamino]methyl]-N-methyl-1-cyclohexanecarboxamide::SMR000635501::cid_20969998
SMILES CCCCN(C)C(=O)C1CCC(CNS(=O)(=O)c2ccc3N(C(C)Cc3c2)C(=O)C2CC2)CC1
InChI Key InChIKey=GJAKUJFZVVAJEM-UHFFFAOYSA-N
Data  1 EC50
  Tab Delimited (TSV)   2D SDfile   Computed 3D by Vconf -m prep SDfile
Find this compound or compounds like it in BindingDB:
Activity Spreadsheet -- Enzyme Inhibition Constant Data from BindingDB
Found 1 hit for monomerid = 72983
TargetHeat shock factor protein 1(Mus musculus)
Broad Institute
Curated by PubChem BioAssay
LigandPNGBDBM72983(MLS001030377 | N-butyl-4-[[(1-cyclopropylcarbonyl-...)
Affinity DataEC50: >2.60E+5nM. Assay description: Keywords: Heat Shock Factor-1 (HSF-1), Stress Response, MG132, NIH3T3, Luminescence Assay Overview: Confirmation testing of small molecules identifie...
In DepthDetails PCBioAssay